{"text_format":"1","workbook":"xlsx","n_sheets":11,"sheets":["Alfrimpa_Formule","Alfrimpa_VBA","brontolo","Cromagno","isy","Luca_73","Mister_x","ninai","Textomb","Zohra","Foglio3"],"not_rendered":{"charts":0,"images":8,"macros":1,"external_links":0,"defined_names":41,"comments":0,"pivot_tables":1},"unopened":[],"bounds":{"document_bytes":16777216,"sheet_cells":100000,"rows_first":2000,"rows_last":500,"rows_between":2000,"halvings":0,"cell_chars":16384,"cell_head_chars":4096},"cells_cut":0,"cells_raw":0,"read":"whole","date_system":"1900"}

{"sheet":"Alfrimpa_Formule","index":0,"n_rows":86,"n_cols":12,"rows_kept":86,"cut":false,"hidden":false,"merged":[[1,2,1,3],[1,4,1,5],[6,2,6,5],[7,10,7,11]]}
[]
[null,null,"SELEZIONA VALORI",null,"ESTRAPOLA VALORI"]
[null,null,"Città","Casa","N.Automobili Vendute","Totali VENDITE"]
[null,null,"Napoli","GOLF",{"$f":"IFERROR(VLOOKUP($C$4&$D$4,$B$9:$F$86,4,FALSE),\"\")","v":195},{"$f":"IFERROR(VLOOKUP($C$4&$D$4,$B$9:$F$86,5,FALSE),\"\")","v":5752500}]
[]
[]
[null,null,"VENDITE REGISTRATE NEL 2014 CASE AUTOMOBILISTICHE"]
[null,"colonna nascosta","Città","Casa","N.Automobili Vendute","Totali VENDITE",null,null,null,null,"Tabella collegata alla convalida dati"]
[null,{"$f":"C9&D9","v":"ArezzoNISSAN"},"Arezzo","NISSAN",165,4702500,null,null,null,null,"Arezzo","NISSAN"]
[null,{"$f":"C10&D10","v":"ArezzoBMW"},"Arezzo","BMW",162,5127300,null,null,null,null,"Bari","BMW"]
[null,"ArezzoGOLF","Arezzo","GOLF",145,4277500,null,null,null,null,"Cesena","GOLF"]
[null,"ArezzoAUDI","Arezzo","AUDI",132,4184400,null,null,null,null,"Ferrara","AUDI"]
[null,"ArezzoMERCEDES","Arezzo","MERCEDES",111,3735150,null,null,null,null,"Firenze","MERCEDES"]
[null,"ArezzoRENAULT","Arezzo","RENAULT",98,2630320,null,null,null,null,"Monza","RENAULT"]
[null,"BariMERCEDES","Bari","MERCEDES",178,5989700,null,null,null,null,"Napoli"]
{"$rows_left_out":72}
{"sheet":"Alfrimpa_VBA","index":1,"n_rows":86,"n_cols":12,"rows_kept":86,"cut":false,"hidden":false,"merged":[[1,2,1,3],[1,4,1,5],[6,2,6,5],[7,10,7,11]]}
[]
[null,null,"SELEZIONA VALORI",null,"ESTRAPOLA VALORI"]
[null,null,"Città","Casa","N.Automobili Vendute","Totali VENDITE"]
[null,null,"Padova","GOLF",{"$f":"IFERROR(trovaval1($C$4,$D$4),\"\")","v":122},{"$f":"IFERROR(trovaval2($C$4,$D$4),\"\")","v":3599000}]
[]
[]
[null,null,"VENDITE REGISTRATE NEL 2014 CASE AUTOMOBILISTICHE"]
[null,null,"Città","Casa","N.Automobili Vendute","Totali VENDITE",null,null,null,null,"Tabella collegata alla convalida dati"]
[null,null,"Arezzo","NISSAN",165,4702500,null,null,null,null,"Arezzo","NISSAN"]
[null,null,"Arezzo","BMW",162,5127300,null,null,null,null,"Bari","BMW"]
[null,null,"Arezzo","GOLF",145,4277500,null,null,null,null,"Cesena","GOLF"]
[null,null,"Arezzo","AUDI",132,4184400,null,null,null,null,"Ferrara","AUDI"]
[null,null,"Arezzo","MERCEDES",111,3735150,null,null,null,null,"Firenze","MERCEDES"]
[null,null,"Arezzo","RENAULT",98,2630320,null,null,null,null,"Monza","RENAULT"]
[null,null,"Bari","MERCEDES",178,5989700,null,null,null,null,"Napoli"]
{"$rows_left_out":72}
{"sheet":"brontolo","index":2,"n_rows":87,"n_cols":24,"rows_kept":87,"cut":false,"hidden":false,"merged":[]}
[]
[null,null,"SELEZIONA VALORI",null,"ESTRAPOLA VALORI (Excel 2000)",null,"ESTRAPOLA VALORI (Excel 2010)"]
[null,null,"Città","Casa","N.Automobili Vendute","Totali VENDITE","N.Automobili Vendute","Totali VENDITE"]
[null,null,"Cesena","BMW",{"$f":"IF(ISERROR(INDEX($E$9:$E$87,SMALL(IF(($C$9:$C$87=C$4)*($D$9:$D$87=D$4),ROW($C$9:$C$87)-8),ROWS($A$4:A4)))),\"\",INDEX($E$9:$E$87,SMALL(IF(($C$9:$C$87=C$4)*($D$9:$D$87=D$4),ROW($C$9:$C$87)-8),ROWS($A$4:A4))))","v":124},{"$f":"IF(ISERROR(INDEX($F$9:$F$87,SMALL(IF(($C$9:$C$87=C$4)*($D$9:$D$87=D$4),ROW($C$9:$C$87)-8),ROWS($A$4:A4)))),\"\",INDEX($F$9:$F$87,SMALL(IF(($C$9:$C$87=C$4)*($D$9:$D$87=D$4),ROW($C$9:$C$87)-8),ROWS($A$4:A4))))","v":3924600},{"$f":"IFERROR(INDEX($E$9:$E$87,SMALL(IF(($C$9:$C$87=C$4)*($D$9:$D$87=D$4),ROW($C$9:$C$87)-8),ROWS($A$4:A4))),\"\")","v":124},{"$f":"IFERROR(INDEX($F$9:$F$87,SMALL(IF(($C$9:$C$87=C$4)*($D$9:$D$87=D$4),ROW($C$9:$C$87)-8),ROWS($A$4:A4))),\"\")","v":3924600}]
[]
[null,null,null,null,null,null,null,null,null,null,"Città","Arezzo","Bari","Cesena","Ferrara","Firenze","Monza","Napoli","Padova","Palermo","Roma","Trieste","Udine","Vicenza"]
[null,null,"VENDITE REGISTRATE NEL 2014 CASE AUTOMOBILISTICHE"]
[null,null,"Città","Casa","N.Automobili Vendute","Totali VENDITE"]
[null,null,"Arezzo","NISSAN",165,4702500]
[null,null,"Arezzo","BMW",162,5127300]
[null,null,"Arezzo","WOLKSWAGEN",145,4277500]
[null,null,"Arezzo","AUDI",132,4184400]
[null,null,"Arezzo","MERCEDES",111,3735150]
[null,null,"Arezzo","MASERATI",2,350000]
[null,null,"Arezzo","RENAULT",98,2630320]
{"$rows_left_out":73}
{"sheet":"Cromagno","index":3,"n_rows":86,"n_cols":12,"rows_kept":86,"cut":false,"hidden":false,"merged":[[1,2,1,3],[1,4,1,5],[4,10,6,11],[6,2,6,5]]}
[]
[null,null,"SELEZIONA VALORI",null,"ESTRAPOLA VALORI"]
[null,null,"Città","Casa","N.Automobili Vendute","Totali VENDITE"]
[null,null,"Napoli","GOLF",{"$f":"VLOOKUP($D$4,INDIRECT(\"D\"&MATCH($C$4,$C$9:$C$86,0)+8&\":F86\"),2,FALSE)","v":195},{"$f":"VLOOKUP($D$4,INDIRECT(\"D\"&MATCH($C$4,$C$9:$C$86,0)+8&\":F86\"),3,FALSE)","v":5752500}]
[null,null,null,null,null,null,null,null,null,null,"COLONNE DI APPOGGIO DA NASCONDERE"]
[]
[null,null,"VENDITE REGISTRATE NEL 2014 CASE AUTOMOBILISTICHE"]
[null,null,"Città","Casa","N.Automobili Vendute","Totali VENDITE"]
[null,1,"Arezzo","NISSAN",165,4702500,null,null,null,null,"Città","Casa"]
[null,2,"Arezzo","BMW",162,5127300,null,null,null,null,"Arezzo","AUDI"]
[null,3,"Arezzo","GOLF",145,4277500,null,null,null,null,"Bari","BMW"]
[null,4,"Arezzo","AUDI",132,4184400,null,null,null,null,"Cesena","GOLF"]
[null,5,"Arezzo","MERCEDES",111,3735150,null,null,null,null,"Ferrara","MERCEDES"]
[null,6,"Arezzo","RENAULT",98,2630320,null,null,null,null,"Firenze","NISSAN"]
[null,7,"Bari","MERCEDES",178,5989700,null,null,null,null,"Monza","RENAULT"]
{"$rows_left_out":72}
{"sheet":"isy","index":4,"n_rows":133,"n_cols":17,"rows_kept":133,"cut":false,"hidden":false,"merged":[[2,2,2,3],[2,4,2,5],[7,2,7,5]]}
["Posizione riga immagine","Formula hyperlink alla foto",null,"Logo","Posizione Riga","Formula hyperlink"]
[{"$f":"IFERROR(VLOOKUP(Criteria2,isy!M109:N133,2,FALSE),1)","v":5},{"$f":"IFERROR(HYPERLINK(\"#\"&CELL(\"indirizzo\",INDIRECT(\"isy!P\"&A2+108,TRUE)),INDIRECT(\"isy!m\"&A2+108,TRUE)),\"\")","v":"BMW"},null,null,{"$f":"IFERROR(MATCH(1,(Città=Criteria1)*(Casa=Criteria2),0)+ROW($C$9),\"\")","v":48},{"$f":"IFERROR(HYPERLINK(\"#\"&CELL(\"indirizzo\",INDIRECT(\"C\"&E2,TRUE)),Criteria2),\"\")","v":"BMW"}]
[null,null,"SELEZIONA VALORI",null,"ESTRAPOLA VALORI"]
["Formule versione\nExcel 2013","Gli elenchi in convalida dati sono ordinati alfabeticamente","Città","Casa","N.Automobili Vendute","Totali VENDITE"]
[null,null,"Napoli","BMW",{"$f":"SUMIFS(SumRange, CriteriaRange1,Criteria1, CriteriaRange2,Criteria2)","v":188},{"$f":"SUMIFS(SumVendite, CriteriaRange1,Criteria1, CriteriaRange2,Criteria2)","v":5950200}]
[]
[]
[null,null,"VENDITE REGISTRATE NEL 2014 CASE AUTOMOBILISTICHE"]
["Unique list sorted alphabetically",null,"Città","Casa","N.Automobili Vendute","Totali VENDITE"]
[{"$f":"INDEX(Città,SMALL(IF(SMALL(IF(COUNTIF($A9:A$9,Città)+ISBLANK(Città)=0,COUNTIF(Città,\"<\"&Città)+1,\"\"),1)=IF(ISBLANK(Città),\"\",COUNTIF(Città,\"<\"&Città)+1),ROW(Città)-MIN(ROW(Città))+1),1),MATCH(MIN(IF(COUNTIF($A9:A$9,Città)+ISBLANK(Città)>0,\"\",COUNTIF(Città,\"<\"&Città)+1)),INDEX(IF(ISBLANK(Città),\"\",COUNTIF(Città,\"<\"&Città)+1),SMALL(IF(SMALL(IF(COUNTIF($A9:A$9,Città)+ISBLANK(Città)=0,COUNTIF(Città,\"<\"&Città)+1,\"\"),1)=IF(ISBLANK(Città),\"\",COUNTIF(Città,\"<\"&Città)+1),ROW(Città)-MIN(ROW(Città))+1),1),,1),0),1)","v":"Arezzo"},{"$f":"INDEX(Casa,SMALL(IF(SMALL(IF(COUNTIF($B9:B$9,Casa)+ISBLANK(Casa)=0,COUNTIF(Casa,\"<\"&Casa)+1,\"\"),1)\n=IF(ISBLANK(Casa),\"\",COUNTIF(Casa,\"<\"&Casa)+1),ROW(Casa)-MIN(ROW(Casa))+1),1),\nMATCH(MIN(IF(COUNTIF($B9:B$9,Casa)+ISBLANK(Casa)>0,\"\",\nCOUNTIF(Casa,\"<\"&Casa)+1)),INDEX(IF(ISBLANK(Casa),\"\",COUNTIF(Casa,\"<\"&Casa)+1),\nSMALL(IF(SMALL(IF(COUNTIF($B9:B$9,Casa)+ISBLANK(Casa)=0,COUNTIF(Casa,\"<\"&Casa)+1,\"\"),1)\n=IF(ISBLANK(Casa),\"\",COUNTIF(Casa,\"<\"&Casa)+1),ROW(Casa)-MIN(ROW(Casa))+1),1),,1),0),1)","v":"AUDI"},"Arezzo","NISSAN",165,4702500]
[{"$f":"INDEX(Città,SMALL(IF(SMALL(IF(COUNTIF($A$9:A10,Città)+ISBLANK(Città)=0,COUNTIF(Città,\"<\"&Città)+1,\"\"),1)=IF(ISBLANK(Città),\"\",COUNTIF(Città,\"<\"&Città)+1),ROW(Città)-MIN(ROW(Città))+1),1),MATCH(MIN(IF(COUNTIF($A$9:A10,Città)+ISBLANK(Città)>0,\"\",COUNTIF(Città,\"<\"&Città)+1)),INDEX(IF(ISBLANK(Città),\"\",COUNTIF(Città,\"<\"&Città)+1),SMALL(IF(SMALL(IF(COUNTIF($A$9:A10,Città)+ISBLANK(Città)=0,COUNTIF(Città,\"<\"&Città)+1,\"\"),1)=IF(ISBLANK(Città),\"\",COUNTIF(Città,\"<\"&Città)+1),ROW(Città)-MIN(ROW(Città))+1),1),,1),0),1)","v":"Bari"},{"$f":"INDEX(Casa,SMALL(IF(SMALL(IF(COUNTIF($B$9:B10,Casa)+ISBLANK(Casa)=0,COUNTIF(Casa,\"<\"&Casa)+1,\"\"),1)=IF(ISBLANK(Casa),\"\",COUNTIF(Casa,\"<\"&Casa)+1),ROW(Casa)-MIN(ROW(Casa))+1),1),MATCH(MIN(IF(COUNTIF($B$9:B10,Casa)+ISBLANK(Casa)>0,\"\",COUNTIF(Casa,\"<\"&Casa)+1)),INDEX(IF(ISBLANK(Casa),\"\",COUNTIF(Casa,\"<\"&Casa)+1),SMALL(IF(SMALL(IF(COUNTIF($B$9:B10,Casa)+ISBLANK(Casa)=0,COUNTIF(Casa,\"<\"&Casa)+1,\"\"),1)=IF(ISBLANK(Casa),\"\",COUNTIF(Casa,\"<\"&Casa)+1),ROW(Casa)-MIN(ROW(Casa))+1),1),,1),0),1)","v":"BMW"},"Arezzo","BMW",162,5127300]
[{"$f":"INDEX(Città,SMALL(IF(SMALL(IF(COUNTIF($A$9:A11,Città)+ISBLANK(Città)=0,COUNTIF(Città,\"<\"&Città)+1,\"\"),1)=IF(ISBLANK(Città),\"\",COUNTIF(Città,\"<\"&Città)+1),ROW(Città)-MIN(ROW(Città))+1),1),MATCH(MIN(IF(COUNTIF($A$9:A11,Città)+ISBLANK(Città)>0,\"\",COUNTIF(Città,\"<\"&Città)+1)),INDEX(IF(ISBLANK(Città),\"\",COUNTIF(Città,\"<\"&Città)+1),SMALL(IF(SMALL(IF(COUNTIF($A$9:A11,Città)+ISBLANK(Città)=0,COUNTIF(Città,\"<\"&Città)+1,\"\"),1)=IF(ISBLANK(Città),\"\",COUNTIF(Città,\"<\"&Città)+1),ROW(Città)-MIN(ROW(Città))+1),1),,1),0),1)","v":"Cesena"},{"$f":"INDEX(Casa,SMALL(IF(SMALL(IF(COUNTIF($B$9:B11,Casa)+ISBLANK(Casa)=0,COUNTIF(Casa,\"<\"&Casa)+1,\"\"),1)=IF(ISBLANK(Casa),\"\",COUNTIF(Casa,\"<\"&Casa)+1),ROW(Casa)-MIN(ROW(Casa))+1),1),MATCH(MIN(IF(COUNTIF($B$9:B11,Casa)+ISBLANK(Casa)>0,\"\",COUNTIF(Casa,\"<\"&Casa)+1)),INDEX(IF(ISBLANK(Casa),\"\",COUNTIF(Casa,\"<\"&Casa)+1),SMALL(IF(SMALL(IF(COUNTIF($B$9:B11,Casa)+ISBLANK(Casa)=0,COUNTIF(Casa,\"<\"&Casa)+1,\"\"),1)=IF(ISBLANK(Casa),\"\",COUNTIF(Casa,\"<\"&Casa)+1),ROW(Casa)-MIN(ROW(Casa))+1),1),,1),0),1)","v":"GOLF"},"Arezzo","GOLF",145,4277500]
[{"$f":"INDEX(Città,SMALL(IF(SMALL(IF(COUNTIF($A$9:A12,Città)+ISBLANK(Città)=0,COUNTIF(Città,\"<\"&Città)+1,\"\"),1)=IF(ISBLANK(Città),\"\",COUNTIF(Città,\"<\"&Città)+1),ROW(Città)-MIN(ROW(Città))+1),1),MATCH(MIN(IF(COUNTIF($A$9:A12,Città)+ISBLANK(Città)>0,\"\",COUNTIF(Città,\"<\"&Città)+1)),INDEX(IF(ISBLANK(Città),\"\",COUNTIF(Città,\"<\"&Città)+1),SMALL(IF(SMALL(IF(COUNTIF($A$9:A12,Città)+ISBLANK(Città)=0,COUNTIF(Città,\"<\"&Città)+1,\"\"),1)=IF(ISBLANK(Città),\"\",COUNTIF(Città,\"<\"&Città)+1),ROW(Città)-MIN(ROW(Città))+1),1),,1),0),1)","v":"Ferrara"},{"$f":"INDEX(Casa,SMALL(IF(SMALL(IF(COUNTIF($B$9:B12,Casa)+ISBLANK(Casa)=0,COUNTIF(Casa,\"<\"&Casa)+1,\"\"),1)=IF(ISBLANK(Casa),\"\",COUNTIF(Casa,\"<\"&Casa)+1),ROW(Casa)-MIN(ROW(Casa))+1),1),MATCH(MIN(IF(COUNTIF($B$9:B12,Casa)+ISBLANK(Casa)>0,\"\",COUNTIF(Casa,\"<\"&Casa)+1)),INDEX(IF(ISBLANK(Casa),\"\",COUNTIF(Casa,\"<\"&Casa)+1),SMALL(IF(SMALL(IF(COUNTIF($B$9:B12,Casa)+ISBLANK(Casa)=0,COUNTIF(Casa,\"<\"&Casa)+1,\"\"),1)=IF(ISBLANK(Casa),\"\",COUNTIF(Casa,\"<\"&Casa)+1),ROW(Casa)-MIN(ROW(Casa))+1),1),,1),0),1)","v":"MERCEDES"},"Arezzo","AUDI",132,4184400]
[{"$f":"INDEX(Città,SMALL(IF(SMALL(IF(COUNTIF($A$9:A13,Città)+ISBLANK(Città)=0,COUNTIF(Città,\"<\"&Città)+1,\"\"),1)=IF(ISBLANK(Città),\"\",COUNTIF(Città,\"<\"&Città)+1),ROW(Città)-MIN(ROW(Città))+1),1),MATCH(MIN(IF(COUNTIF($A$9:A13,Città)+ISBLANK(Città)>0,\"\",COUNTIF(Città,\"<\"&Città)+1)),INDEX(IF(ISBLANK(Città),\"\",COUNTIF(Città,\"<\"&Città)+1),SMALL(IF(SMALL(IF(COUNTIF($A$9:A13,Città)+ISBLANK(Città)=0,COUNTIF(Città,\"<\"&Città)+1,\"\"),1)=IF(ISBLANK(Città),\"\",COUNTIF(Città,\"<\"&Città)+1),ROW(Città)-MIN(ROW(Città))+1),1),,1),0),1)","v":"Firenze"},{"$f":"INDEX(Casa,SMALL(IF(SMALL(IF(COUNTIF($B$9:B13,Casa)+ISBLANK(Casa)=0,COUNTIF(Casa,\"<\"&Casa)+1,\"\"),1)=IF(ISBLANK(Casa),\"\",COUNTIF(Casa,\"<\"&Casa)+1),ROW(Casa)-MIN(ROW(Casa))+1),1),MATCH(MIN(IF(COUNTIF($B$9:B13,Casa)+ISBLANK(Casa)>0,\"\",COUNTIF(Casa,\"<\"&Casa)+1)),INDEX(IF(ISBLANK(Casa),\"\",COUNTIF(Casa,\"<\"&Casa)+1),SMALL(IF(SMALL(IF(COUNTIF($B$9:B13,Casa)+ISBLANK(Casa)=0,COUNTIF(Casa,\"<\"&Casa)+1,\"\"),1)=IF(ISBLANK(Casa),\"\",COUNTIF(Casa,\"<\"&Casa)+1),ROW(Casa)-MIN(ROW(Casa))+1),1),,1),0),1)","v":"NISSAN"},"Arezzo","MERCEDES",111,3735150]
[{"$f":"INDEX(Città,SMALL(IF(SMALL(IF(COUNTIF($A$9:A14,Città)+ISBLANK(Città)=0,COUNTIF(Città,\"<\"&Città)+1,\"\"),1)=IF(ISBLANK(Città),\"\",COUNTIF(Città,\"<\"&Città)+1),ROW(Città)-MIN(ROW(Città))+1),1),MATCH(MIN(IF(COUNTIF($A$9:A14,Città)+ISBLANK(Città)>0,\"\",COUNTIF(Città,\"<\"&Città)+1)),INDEX(IF(ISBLANK(Città),\"\",COUNTIF(Città,\"<\"&Città)+1),SMALL(IF(SMALL(IF(COUNTIF($A$9:A14,Città)+ISBLANK(Città)=0,COUNTIF(Città,\"<\"&Città)+1,\"\"),1)=IF(ISBLANK(Città),\"\",COUNTIF(Città,\"<\"&Città)+1),ROW(Città)-MIN(ROW(Città))+1),1),,1),0),1)","v":"Monza"},{"$f":"INDEX(Casa,SMALL(IF(SMALL(IF(COUNTIF($B$9:B14,Casa)+ISBLANK(Casa)=0,COUNTIF(Casa,\"<\"&Casa)+1,\"\"),1)=IF(ISBLANK(Casa),\"\",COUNTIF(Casa,\"<\"&Casa)+1),ROW(Casa)-MIN(ROW(Casa))+1),1),MATCH(MIN(IF(COUNTIF($B$9:B14,Casa)+ISBLANK(Casa)>0,\"\",COUNTIF(Casa,\"<\"&Casa)+1)),INDEX(IF(ISBLANK(Casa),\"\",COUNTIF(Casa,\"<\"&Casa)+1),SMALL(IF(SMALL(IF(COUNTIF($B$9:B14,Casa)+ISBLANK(Casa)=0,COUNTIF(Casa,\"<\"&Casa)+1,\"\"),1)=IF(ISBLANK(Casa),\"\",COUNTIF(Casa,\"<\"&Casa)+1),ROW(Casa)-MIN(ROW(Casa))+1),1),,1),0),1)","v":"RENAULT"},"Arezzo","RENAULT",98,2630320]
{"$rows_left_out":119}
{"sheet":"Luca_73","index":5,"n_rows":86,"n_cols":6,"rows_kept":86,"cut":false,"hidden":false,"merged":[[1,2,1,3],[1,4,1,5],[6,2,6,5]]}
[]
[null,null,"SELEZIONA VALORI",null,"ESTRAPOLA VALORI"]
[null,null,"Città","Casa","N.Automobili Vendute","Totali VENDITE"]
[null,null,"cesena","golf",{"$f":"DSUM(C8:F86,E3,C3:D4)","v":84},{"$f":"DSUM(C8:F86,F3,C3:D4)","v":2478000}]
[]
[]
[null,null,"VENDITE REGISTRATE NEL 2014 CASE AUTOMOBILISTICHE"]
[null,null,"Città","Casa","N.Automobili Vendute","Totali VENDITE"]
[null,null,"Arezzo","NISSAN",165,4702500]
[null,null,"Arezzo","BMW",162,5127300]
[null,null,"Arezzo","GOLF",145,4277500]
[null,null,"Arezzo","AUDI",132,4184400]
[null,null,"Arezzo","MERCEDES",111,3735150]
[null,null,"Arezzo","RENAULT",98,2630320]
[null,null,"Bari","MERCEDES",178,5989700]
{"$rows_left_out":72}
{"sheet":"Mister_x","index":6,"n_rows":86,"n_cols":12,"rows_kept":86,"cut":false,"hidden":false,"merged":[[1,2,1,3],[1,4,1,5],[6,2,6,5],[7,10,7,11]]}
[]
[null,null,"SELEZIONA VALORI",null,"ESTRAPOLA VALORI"]
[null,null,"Città","Casa","N.Automobili Vendute","Totali VENDITE"]
[null,null,"Napoli","NISSAN",{"$f":"SUMIFS(E9:E86,$C$9:$C$86,$C$4,$D$9:$D$86,$D$4)","v":145},{"$f":"SUMIFS(F9:F86,$C$9:$C$86,$C$4,$D$9:$D$86,$D$4)","v":4132500}]
[]
[]
[null,null,"VENDITE REGISTRATE NEL 2014 CASE AUTOMOBILISTICHE"]
[null,null,"Città","Casa","N.Automobili Vendute","Totali VENDITE",null,null,null,null,"Tabella collegata alla convalida dati"]
[null,null,"Arezzo","NISSAN",165,4702500,null,null,null,null,"Arezzo","GOLF"]
[null,null,"Arezzo","BMW",162,5127300,null,null,null,null,"Bari","AUDI"]
[null,null,"Arezzo","GOLF",145,4277500,null,null,null,null,"Cesena","BMW"]
[null,null,"Arezzo","AUDI",132,4184400,null,null,null,null,"Ferrara","MERCEDES"]
[null,null,"Arezzo","MERCEDES",111,3735150,null,null,null,null,"Firenze","NISSAN"]
[null,null,"Arezzo","RENAULT",98,2630320,null,null,null,null,"Monza","RENAULT"]
[null,null,"Bari","MERCEDES",178,5989700,null,null,null,null,"Napoli",""]
{"$rows_left_out":72}
{"sheet":"ninai","index":7,"n_rows":86,"n_cols":12,"rows_kept":86,"cut":false,"hidden":false,"merged":[[1,2,1,3],[1,4,1,5],[6,2,6,5],[7,10,7,11]]}
[]
[null,null,"SELEZIONA VALORI",null,"ESTRAPOLA VALORI"]
[null,null,"Città","Casa","N.Automobili Vendute","Totali VENDITE"]
[null,null,"Napoli","NISSAN",{"$f":"SUMPRODUCT(($C$9:$C$86=$C$4)*($D$9:$D$86=$D$4)*E9:E86)","v":145},{"$f":"SUMPRODUCT(($C$9:$C$86=$C$4)*($D$9:$D$86=$D$4)*F9:F86)","v":4132500}]
[]
[]
[null,null,"VENDITE REGISTRATE NEL 2014 CASE AUTOMOBILISTICHE"]
[null,null,"Città","Casa","N.Automobili Vendute","Totali VENDITE",null,null,null,null,"Formule per elenco valori univoci"]
[null,null,"Arezzo","NISSAN",165,4702500,null,null,null,null,{"$f":"IFERROR(INDEX(C$9:C$86,MATCH(0,INDEX(COUNTIF(K$8:K8,C$9:C$86&\"\"),),0)),\"\")","v":"Arezzo"},{"$f":"IFERROR(INDEX(D$9:D$86,MATCH(0,INDEX(COUNTIF(L$8:L8,D$9:D$86&\"\")+(C$9:C$86<>$C$4),),0)),\"\")","v":"GOLF"}]
[null,null,"Arezzo","BMW",162,5127300,null,null,null,null,{"$f":"IFERROR(INDEX(C$9:C$86,MATCH(0,INDEX(COUNTIF(K$8:K9,C$9:C$86&\"\"),),0)),\"\")","v":"Bari"},{"$f":"IFERROR(INDEX(D$9:D$86,MATCH(0,INDEX(COUNTIF(L$8:L9,D$9:D$86&\"\")+(C$9:C$86<>$C$4),),0)),\"\")","v":"RENAULT"}]
[null,null,"Arezzo","GOLF",145,4277500,null,null,null,null,{"$f":"IFERROR(INDEX(C$9:C$86,MATCH(0,INDEX(COUNTIF(K$8:K10,C$9:C$86&\"\"),),0)),\"\")","v":"Cesena"},{"$f":"IFERROR(INDEX(D$9:D$86,MATCH(0,INDEX(COUNTIF(L$8:L10,D$9:D$86&\"\")+(C$9:C$86<>$C$4),),0)),\"\")","v":"BMW"}]
[null,null,"Arezzo","AUDI",132,4184400,null,null,null,null,{"$f":"IFERROR(INDEX(C$9:C$86,MATCH(0,INDEX(COUNTIF(K$8:K11,C$9:C$86&\"\"),),0)),\"\")","v":"Ferrara"},{"$f":"IFERROR(INDEX(D$9:D$86,MATCH(0,INDEX(COUNTIF(L$8:L11,D$9:D$86&\"\")+(C$9:C$86<>$C$4),),0)),\"\")","v":"AUDI"}]
[null,null,"Arezzo","MERCEDES",111,3735150,null,null,null,null,{"$f":"IFERROR(INDEX(C$9:C$86,MATCH(0,INDEX(COUNTIF(K$8:K12,C$9:C$86&\"\"),),0)),\"\")","v":"Firenze"},{"$f":"IFERROR(INDEX(D$9:D$86,MATCH(0,INDEX(COUNTIF(L$8:L12,D$9:D$86&\"\")+(C$9:C$86<>$C$4),),0)),\"\")","v":"NISSAN"}]
[null,null,"Arezzo","RENAULT",98,2630320,null,null,null,null,{"$f":"IFERROR(INDEX(C$9:C$86,MATCH(0,INDEX(COUNTIF(K$8:K13,C$9:C$86&\"\"),),0)),\"\")","v":"Monza"},{"$f":"IFERROR(INDEX(D$9:D$86,MATCH(0,INDEX(COUNTIF(L$8:L13,D$9:D$86&\"\")+(C$9:C$86<>$C$4),),0)),\"\")","v":"MERCEDES"}]
[null,null,"Bari","MERCEDES",178,5989700,null,null,null,null,{"$f":"IFERROR(INDEX(C$9:C$86,MATCH(0,INDEX(COUNTIF(K$8:K14,C$9:C$86&\"\"),),0)),\"\")","v":"Napoli"},{"$f":"IFERROR(INDEX(D$9:D$86,MATCH(0,INDEX(COUNTIF(L$8:L14,D$9:D$86&\"\")+(C$9:C$86<>$C$4),),0)),\"\")","v":""}]
{"$rows_left_out":72}
{"sheet":"Textomb","index":8,"n_rows":86,"n_cols":6,"rows_kept":86,"cut":false,"hidden":false,"merged":[[1,4,1,5],[1,2,1,3],[6,2,6,5]]}
[]
[null,null,"SELEZIONA VALORI",null,"ESTRAPOLA VALORI"]
[null,null,"Città","Casa","N.Automobili Vendute","Totali VENDITE"]
[null,null,"Cesena","GOLF",{"$f":"OFFSET(C8,MATCH(C4&D4,C9:C86&D9:D86,0),2)","v":84},{"$f":"OFFSET(D8,MATCH(D4&E4,D9:D86&E9:E86,0),2)","v":2478000}]
[]
[]
[null,null,"VENDITE REGISTRATE NEL 2014 CASE AUTOMOBILISTICHE"]
[null,null,"Città","Casa","N.Automobili Vendute","Totali VENDITE"]
[null,null,"Arezzo","NISSAN",165,4702500]
[null,null,"Arezzo","BMW",162,5127300]
[null,null,"Arezzo","GOLF",145,4277500]
[null,null,"Arezzo","AUDI",132,4184400]
[null,null,"Arezzo","MERCEDES",111,3735150]
[null,null,"Arezzo","RENAULT",98,2630320]
[null,null,"Bari","MERCEDES",178,5989700]
{"$rows_left_out":72}
{"sheet":"Zohra","index":9,"n_rows":86,"n_cols":14,"rows_kept":86,"cut":false,"hidden":false,"merged":[[1,2,1,3],[1,5,1,6],[6,2,6,6],[7,12,7,13]]}
[]
[null,null,"SELEZIONA VALORI",null,null,"ESTRAPOLA VALORI"]
[null,null,"Città","Casa","colonna nascosta","N.Automobili Vendute","Totali VENDITE"]
[null,null,"Ferrara","BMW",{"$f":"CONCATENATE(C4,D4)","v":"FerraraBMW"},{"$f":"VLOOKUP(E4,$E$9:$G$86,2,FALSE)","v":94},{"$f":"VLOOKUP(E4,$E$9:$G$86,3,FALSE)","v":2975100}]
[]
[]
[null,null,"VENDITE REGISTRATE NEL 2014 CASE AUTOMOBILISTICHE"]
[null,null,"Città","Casa","colonna nascosta","N.Automobili Vendute","Totali VENDITE",null,null,null,null,null,"Tabella collegata alla convalida dati"]
[null,null,"Arezzo","AUDI","ArezzoAUDI",132,4184400,null,null,null,null,null,"Arezzo","NISSAN"]
[null,null,"Arezzo","BMW","ArezzoBMW",162,5127300,null,null,null,null,null,"Bari","BMW"]
[null,null,"Arezzo","GOLF","ArezzoGOLF",145,4277500,null,null,null,null,null,"Cesena","GOLF"]
[null,null,"Arezzo","MERCEDES","ArezzoMERCEDES",111,3735150,null,"Città","Cesena",null,null,"Ferrara","AUDI"]
[null,null,"Arezzo","NISSAN","ArezzoNISSAN",165,4702500,null,"Casa","MERCEDES",null,null,"Firenze","MERCEDES"]
[null,null,"Arezzo","RENAULT","ArezzoRENAULT",98,2630320,null,null,null,null,null,"Monza","RENAULT"]
[null,null,"Bari","AUDI","BariAUDI",108,3423600,null,"Somma di N.Automobili Vendute","Somma di Totali VENDITE",null,null,"Napoli"]
{"$rows_left_out":72}
{"sheet":"Foglio3","index":10,"n_rows":0,"n_cols":0,"rows_kept":0,"cut":false,"hidden":false,"merged":[]}